{"text_format":"3","workbook":"xlsx","n_sheets":8,"sheets":["Index","General Info","Financial Results","Asset Liabilities","Segment","TextBlock","OCI","Taxonomy"],"not_rendered":{"images":1,"macros":1,"defined_names":3},"read":"whole","date_system":"1900"}

{"sheet":"Index","index":0,"n_rows":50,"n_cols":10,"rows_kept":50,"merged":[[5,4,5,8],[6,5,6,8],[7,5,7,8],[8,5,8,8],[9,5,9,8],[12,3,12,9],[13,3,13,9],[14,3,14,9],[17,3,17,9],[18,3,18,9],[19,3,19,9],[20,3,20,9],[21,3,21,9],[22,3,22,9],[25,3,25,9],[26,4,26,8],[27,4,27,8],[28,4,28,8],[29,4,29,8],[30,4,30,8],[32,3,32,9],[33,3,33,9],[34,3,34,9],[35,3,35,9],[36,3,36,9],[37,3,37,9],[38,3,38,9],[39,3,39,9],[42,3,42,9],[43,3,43,9],[44,3,44,9],[45,3,45,9],[46,3,46,9],[47,3,47,9],[48,3,48,9],[49,3,49,9]]}
[]
[]
[]
[]
[]
[{"$nulls":4},"                                      XBRL Excel Utility"]
[{"$nulls":4},"1.","Overview"]
[{"$nulls":4},"2.","Before you begin"]
[{"$nulls":4},"3.","Index"]
[{"$nulls":4},"4.","Steps for filing - Financial Results - Ind AS Format"]
[]
[]
[{"$nulls":3},"1. Overview"]
[{"$nulls":3},"The excel utility can be used for creating the XBRL/XML file for efiling of Financial Results"]
[{"$nulls":3},"XBRL filling consists of two processes. Firstly generation of XBRL/XML file and upload of generated XBRL/XML file to BSE Listing Center Website (www.listing.bseindia.com) ."]
[]
[]
[{"$nulls":3}," 2.  Before you begin"]
[{"$nulls":3},"1. The version of Microsoft Excel in your system should be Microsoft Office Excel 2007 and above."]
[{"$nulls":3},"2. The system should have a file compression software to unzip excel utility file."]
[{"$nulls":3},"3. Make sure that you have downloaded the latest Excel Utility from BSE Website to your local system."]
[{"$nulls":3},"4. Make sure that you have downloaded the Chrome Browser to view report generated from Excel utility"]
[{"$nulls":3},"5. Please enable the Macros (if disabled) as per instructions given in manual, so that all the functionalities of  Excel Utility works fine. Please first go through Enable Macro - Manual attached with zip file."]
[]
[]
[{"$nulls":3},"3. Index "]
[{"$nulls":3},1,"Details of general information about company",{"$nulls":4},"General Info"]
[{"$nulls":3},2,"Financial Result By Companies Other than Banks",{"$nulls":4},"Quarterly"]
[{"$nulls":3},3,"Statement of Asset and Liabilities",{"$nulls":4},"Asset Liabilities"]
[{"$nulls":3},4,"Format of Reporting of Segment wise Revenue, Result and Capital Employed along with the quartely results",{"$nulls":4},"Segment"]
[{"$nulls":3},5,"OCI (Other Comprehensive Income)",{"$nulls":4},"OCI"]
[]
[{"$nulls":3},"4. Steps for Filing Of  Financial Results"]
[{"$nulls":3},"I.  Fill up the data: Navigate to each field of every section in the sheet to provide applicable data in correct format.  (Formats will get reflected while filling data.)  \n   - Use paste special command to paste data from other sheet."]
[{"$nulls":3},"II. Validating Sheets:  Click on the ''Validate \"  button to ensure that the sheet has been properly filled and also data has been furnished in proper format. If there are some errors on the sheet, excel utility will prompt you about the same."]
[{"$nulls":3},"III. Validate All Sheets:  Click on the ''Home\"  button. And then click on \"Validate All Sheet\" button to ensure that all sheets has been properly filled and validated successfully. If there are some errors on the sheet, excel utility will prompt you about the same and stop validation at the same time. After correction, once again follow the same procedure to validate all sheets."]
[{"$nulls":3},"Excel Utility will not allow you to generate XBRL/XML until you rectify all errors. "]
[{"$nulls":3},"IV. Generate XML :   Excel Utility will not allow you to generate XBRL/XML unless successful validation of all sheet is completed. Now click on 'Generate XML'' to generate XBRL/XML file. \n    - Save the XBRL/XML file in your desired folder in local system. "]
[{"$nulls":3},"V. Generate Report :   Excel Utility will allow you to generate Report. Now click on 'Generate Report'' to generate html report.   \n     - Save the HTML Report file in your desired folder in local system.     \n     - To view HTML Report open \"Chrome Web Browser\" . \n     - To print report in PDF Format, Click on print button and save as PDF. "]
[{"$nulls":3},"VI. Upload XML file to BSE Listing Center: For uploading the XBRL/XML file generated through  Utility, login to BSE Listing Center and upload generated xml file. On Upload screen provide the required information and browse to select XML file and submit the XML.\n"]
[]
[]
[{"$nulls":3},"5. Fill up the data in excel utility"]
[{"$nulls":3},"1. Cells with red fonts indicate mandatory fields. "]
[{"$nulls":3},"2. If mandatory field is left empty, then Utility will not allow you to proceed further for generating XML."]
[{"$nulls":3},"3. You are not allowed to enter data in the Grey Cells."]
[{"$nulls":3},"4. If fields are not applicable to your company then leave it blank. Do not insert Zero unless it is a mandatory field."]
[{"$nulls":3},"5. Data provided must be in correct format, otherwise Utility will not allow you to proceed further for generating XML."]
[{"$nulls":3},"6. Select data from \"Dropdown list\" wherever applicable. "]
[{"$nulls":3},"7. Adding Notes:  Click on \"Add Notes\" button to add notes "]

{"sheet":"General Info","index":1,"n_rows":71,"n_cols":21,"rows_kept":71,"merged":[[8,3,8,6],[9,5,11,6],[20,5,20,6],[21,5,22,6]]}
[]
[{"$nulls":17},"Actual",null,"Audited"]
[{"$nulls":16},"Consolidated","Thousands",null,"Unaudited"]
[{"$nulls":16},"Standalone","Lakhs","Single segment"]
[{"$nulls":17},"Millions","Multi segment","First quarter","Half yearly"]
[{"$nulls":17},"Billions","Geographical","Half yearly","Yearly"]
[{"$nulls":17},"Crores",null,"Third quarter"]
[{"$nulls":19},"Yearly"]
[{"$nulls":3},"General information about company"]
[{"$nulls":3},"Scrip code",526365,{"$nulls":9},"Equity"]
[{"$nulls":3},"Name of company","SWARNSARITA GEMS LTD",{"$nulls":9},"Debt securities and/or non-cumulative redeemable preference shares",null,"00"]
[{"$nulls":3},"Class of security","Equity",{"$nulls":9},"Equity and Debt",null,"01","01","2014"]
[{"$nulls":3},"Date of start of financial year","01","04",2017,{"$nulls":9},"02","02","2015"]
[{"$nulls":3},"Date of end of financial year","31","03",2018,{"$nulls":9},"03","03","2016"]
[{"$nulls":3},"Date of board meeting when results were approved","14","08",2017,{"$nulls":9},"04","04",2017]
[{"$nulls":3},"Date on which prior intimation of the meeting for considering financial results was informed to the exchange","03","08",2017,{"$nulls":9},"05","05",2018]
[{"$nulls":3},"Description of presentation currency","INR",{"$nulls":11},"06","06",2019]
[{"$nulls":3},"Level of rounding used in financial results","Lakhs",{"$nulls":11},"07","07",2020]
[{"$nulls":3},"Reporting Quarter","First quarter",{"$nulls":11},"08","08",2021]
[{"$nulls":3},"Nature of report standalone or consolidated","Consolidated",{"$nulls":11},"09","09",2022]
[{"$nulls":3},"Whether results are audited or unaudited","Unaudited","For Current Quarter Only",{"$nulls":10},"10","10",2023]
[{"$nulls":3},"Segment Reporting","Multi segment",{"$nulls":11},"11","11",2024]
[{"$nulls":3},"Description of single segment",{"$nulls":12},"12","12",2025]
[{"$nulls":3},"Start time of board meeting","15","30","HH:MM",{"$nulls":9},"13",null,2026]
[{"$nulls":3},"End time of board meeting","17","30","HH:MM",{"$nulls":9},"14",null,2027]
[{"$nulls":16},"15"]
[{"$nulls":16},"16"]
[{"$nulls":16},"17"]
[{"$nulls":16},"18"]
[{"$nulls":16},"19"]
[{"$nulls":16},"20"]
[{"$nulls":16},"21"]
[{"$nulls":16},"22"]
[{"$nulls":16},"23"]
[{"$nulls":16},"24"]
[{"$nulls":16},"25"]
[{"$nulls":16},"26"]
[{"$nulls":16},"27"]
[{"$nulls":16},"28"]
[{"$nulls":16},"29"]
[{"$nulls":16},"30"]
[{"$nulls":16},"31"]
[{"$nulls":16},32]
[{"$nulls":16},33]
[{"$nulls":16},34]
[{"$nulls":16},35]
[{"$nulls":16},36]
[{"$nulls":16},37]
[{"$nulls":16},38]
[{"$nulls":16},39]
[{"$nulls":16},40]
[{"$nulls":16},41]
[{"$nulls":16},42]
[{"$nulls":16},43]
[{"$nulls":16},44]
[{"$nulls":16},45]
[{"$nulls":16},46]
[{"$nulls":16},47]
[{"$nulls":16},48]
[{"$nulls":16},49]
[{"$nulls":16},50]
[{"$nulls":16},51]
[{"$nulls":16},52]
[{"$nulls":16},53]
[{"$nulls":16},54]
[{"$nulls":16},55]
[{"$nulls":16},56]
[{"$nulls":16},57]
[{"$nulls":16},58]
[{"$nulls":16},59]
[{"$nulls":16},60]

{"sheet":"Financial Results","index":2,"n_rows":82,"n_cols":19,"rows_kept":82,"merged":[[7,3,7,6],[8,3,8,4],[13,4,13,6],[14,5,14,6],[18,5,18,6],[25,5,25,6],[41,5,41,6],[54,5,54,6],[57,5,57,6],[60,5,60,6],[63,5,63,6],[68,5,68,6],[69,5,69,6],[72,5,72,6],[75,5,75,6]]}
{"$rows_empty":7}
[{"$nulls":3},"Financial Results – Ind-AS"]
[{"$nulls":3},"Particulars",null,"3 months/ 6 months ended         (dd-mm-yyyy)","Year to date figures for current period ended                              (dd-mm-yyyy)"]
[{"$nulls":3},"A","Date of start of reporting period","01-04-2017","01-04-2017"]
[{"$nulls":3},"B","Date of end of reporting period","30-06-2017","30-06-2017"]
[{"$nulls":3},"C","Whether results are audited or unaudited","Unaudited","Unaudited",{"$nulls":7},"Audited"]
[{"$nulls":3},"D","Nature of report standalone or consolidated",{"$f":"+IF(COUNTA('General Info'!E20),'General Info'!E20,\"\")","v":"Consolidated"},{"$f":"+IF(COUNTA('General Info'!E20),'General Info'!E20,\"\")","v":"Consolidated"},{"$nulls":7},"Unaudited"]
[{"$nulls":3},"Part I","Blue color marked fields are non-mandatory.                                                                                                                                                                   For Consolidated Results, if the company has no figures for 3 months / 6 months ended, in such case zero shall be inserted in the said column."]
[{"$nulls":3},1,"Income"]
[{"$nulls":4},"Revenue from operations",{"v":9498.77,"d":"9498.770"},{"$f":"+IF(COUNT(F16),+F16,\"\")","v":{"v":9498.77,"d":"9498.770"}},{"$nulls":11},{"$f":"+IF(COUNT(F16),+F16,\"\")","v":9498.77}]
[{"$nulls":4},"Other income",{"v":58.43,"d":"58.430"},{"$f":"+IF(COUNT(F17),+F17,\"\")","v":{"v":58.43,"d":"58.430"}},{"$nulls":11},{"$f":"+IF(COUNT(F17),+F17,\"\")","v":58.43}]
[{"$nulls":4},"Total income",{"$f":"+IF(COUNT(F16:F17),ROUND(SUM(F16:F17),3),\"\")","v":{"v":9557.2,"d":"9557.200"}},{"$f":"+IF(COUNT(G16:G17),ROUND(SUM(G16:G17),3),\"\")","v":{"v":9557.2,"d":"9557.200"}},{"$nulls":11},9557.2]
[{"$nulls":3},2,"Expenses",{"$nulls":13},""]
[{"$nulls":3},"(a)","Cost of materials consumed",{"v":11470.86,"d":"11470.860"},{"$f":"+IF(COUNT(F20),+F20,\"\")","v":{"v":11470.86,"d":"11470.860"}},{"$nulls":11},11470.86]
[{"$nulls":3},"(b)","Purchases of stock-in-trade",{"v":0,"d":"0.000"},{"v":0,"d":"0.000"},{"$nulls":11},0]
[{"$nulls":3},"(c)","Changes in inventories of finished goods, work-in-progress and stock-in-trade",{"v":-2295.5,"d":"-2295.500"},{"v":-2295.5,"d":"-2295.500"},{"$nulls":11},-2295.5]
[{"$nulls":3},"(d)","Employee benefit expense  ",{"v":94.14,"d":"94.140"},{"v":94.14,"d":"94.140"},{"$nulls":11},94.14]
[{"$nulls":3},"(e)","Finance costs",{"v":83.3,"d":"83.300"},{"v":83.3,"d":"83.300"},{"$nulls":11},83.3]
[{"$nulls":3},"(f)","Depreciation, depletion and amortisation expense",{"v":4.67,"d":"4.670"},{"v":4.67,"d":"4.670"},{"$nulls":11},4.67]
[{"$nulls":3},"(f)","Other Expenses",{"$nulls":13},""]
[{"$nulls":3},1,"FRIGHT CHARGES,RENT,EXHIBITION CHARGES,OFFICE EXP,TRAVELLING EXP.",{"v":79.01,"d":"79.010"},{"$f":"+IF(COUNT(F27),+F27,\"\")","v":{"v":79.01,"d":"79.010"}},{"$nulls":11},79.01]
[{"$nulls":3},2,null,null,"",{"$nulls":11},""]
[{"$nulls":3},3,null,null,"",{"$nulls":11},""]
[{"$nulls":3},4,null,null,"",{"$nulls":11},""]
[{"$nulls":3},5,null,null,"",{"$nulls":11},""]
[{"$nulls":3},6,null,null,"",{"$nulls":11},""]
[{"$nulls":3},7,null,null,"",{"$nulls":11},""]
[{"$nulls":3},8,null,null,"",{"$nulls":11},""]
[{"$nulls":3},9,null,null,"",{"$nulls":11},""]
[{"$nulls":3},10,null,null,"",{"$nulls":11},""]
[{"$nulls":4},"Total other expenses",{"$f":"+IF(COUNT(F27:F36),ROUND(SUM(F27:F36),3),\"\")","v":{"v":79.01,"d":"79.010"}},{"$f":"+IF(COUNT(G27:G36),ROUND(SUM(G27:G36),3),\"\")","v":{"v":79.01,"d":"79.010"}},{"$nulls":11},79.01]
[{"$nulls":4},"Total  expenses",{"$f":"+IF(COUNT(F37,F20:F25),SUM(F37,F20:F25),\"\")","v":{"v":9436.48,"d":"9436.480"}},{"v":9436.48,"d":"9436.480"},{"$nulls":11},9436.48]
[{"$nulls":3},3,"Total profit before exceptional items and tax",{"$f":"+IF(COUNT(F38,F18),+ROUND(SUM(F18)-SUM(F38),3),\"\")","v":{"v":120.72,"d":"120.720"}},{"v":120.72,"d":"120.720"},{"$nulls":11},120.72]
[{"$nulls":3},4,"Exceptional items ",{"v":0,"d":"0.000"},{"$f":"+IF(COUNT(F40),+F40,\"\")","v":{"v":0,"d":"0.000"}},{"$nulls":11},0]
[{"$nulls":3},5,"Total profit before tax",{"$f":"+IF(COUNT(F39:F40),+ROUND(SUM(F39)+SUM(F40),3),\"\")","v":{"v":120.72,"d":"120.720"}},{"$f":"+IF(COUNT(G39:G40),+ROUND(SUM(G39)+SUM(G40),3),\"\")","v":{"v":120.72,"d":"120.720"}},{"$nulls":11},120.72]
[{"$nulls":3},7,"Tax expense",{"$nulls":13},""]
[{"$nulls":3},8,"Current tax",{"v":36.22,"d":"36.220"},{"$f":"+IF(COUNT(F43),+F43,\"\")","v":{"v":36.22,"d":"36.220"}},{"$nulls":11},36.22]
[{"$nulls":3},9,"Deferred tax",{"v":0,"d":"0.000"},{"$f":"+IF(COUNT(F44),+F44,\"\")","v":{"v":0,"d":"0.000"}},{"$nulls":11},0]
[{"$nulls":3},10,"Total tax expenses",{"$f":"+IF(COUNT(F43:F44),+ROUND(SUM(F43:F44),3),\"\")","v":{"v":36.22,"d":"36.220"}},{"$f":"+IF(COUNT(G43:G44),+ROUND(SUM(G43:G44),3),\"\")","v":{"v":36.22,"d":"36.220"}},{"$nulls":11},36.22]
[{"$nulls":3},11,"Net movement in regulatory deferral account balances related to profit or loss and the related deferred tax movement",{"v":0,"d":"0.000"},{"$f":"+IF(COUNT(F46),+F46,\"\")","v":{"v":0,"d":"0.000"}},{"$nulls":11},0]
[{"$nulls":3},14,"Net Profit Loss for the period from continuing operations",{"$f":"+IF(COUNT(F41,F45,F46),+ROUND(SUM(F41)-SUM(F45)+SUM(F46),3),\"\")","v":{"v":84.5,"d":"84.500"}},{"$f":"+IF(COUNT(G41,G45,G46),+ROUND(SUM(G41)-SUM(G45)+SUM(G46),3),\"\")","v":{"v":84.5,"d":"84.500"}},{"$nulls":11},84.5]
[{"$nulls":3},15,"Profit (loss) from discontinued operations before tax",{"v":0,"d":"0.000"},{"$f":"+IF(COUNT(F48),+F48,\"\")","v":{"v":0,"d":"0.000"}},{"$nulls":11},0]
[{"$nulls":3},16,"Tax expense of discontinued operations",{"v":0,"d":"0.000"},{"$f":"+IF(COUNT(F49),+F49,\"\")","v":{"v":0,"d":"0.000"}},{"$nulls":11},0]
[{"$nulls":3},17,"Net profit (loss) from discontinued operation after tax",{"$f":"+IF(COUNT(F48:F49),+ROUND(SUM(F48)-SUM(F49),3),\"\")","v":{"v":0,"d":"0.000"}},{"$f":"+IF(COUNT(G48:G49),+ROUND(SUM(G48)-SUM(G49),3),\"\")","v":{"v":0,"d":"0.000"}},{"$nulls":11},0]
[{"$nulls":3},19,"Share of profit (loss) of associates and joint ventures accounted for using equity method",{"v":0,"d":"0.000"},{"$f":"+IF(COUNT(F51),+F51,\"\")","v":{"v":0,"d":"0.000"}},{"$nulls":11},0]
[{"$nulls":3},21,"Total profit (loss) for period",{"$f":"+IF(COUNT(F47,F50,F51),ROUND(SUM(F47)+SUM(F50:F51),3),\"\")","v":{"v":84.5,"d":"84.500"}},{"$f":"+IF(COUNT(G47,G50,G51),ROUND(SUM(G47)+SUM(G50:G51),3),\"\")","v":{"v":84.5,"d":"84.500"}},{"$nulls":11},84.5]
[{"$nulls":3},22,"Other comprehensive income net of taxes",{"v":0,"d":"0.000"},{"$f":"+IF(COUNT(F53),+F53,\"\")","v":{"v":0,"d":"0.000"}},{"$nulls":11},0]
[{"$nulls":3},23,"Total Comprehensive Income for the period",{"$f":"+IF(COUNT(F52:F53),SUM(F52:F53),\"\")","v":{"v":84.5,"d":"84.500"}},{"$f":"+IF(COUNT(G52:G53),SUM(G52:G53),\"\")","v":{"v":84.5,"d":"84.500"}},{"$nulls":11},84.5]
[{"$nulls":3},24,"Total profit or loss, attributable to",{"$nulls":13},""]
[{"$nulls":4},"Profit or loss, attributable to owners of parent",null,{"$f":"+IF(COUNT(F56),+F56,\"\")","v":""},{"$nulls":11},""]
[{"$nulls":4},"Total profit or loss, attributable to non-controlling interests",null,{"$f":"+IF(COUNT(F57),+F57,\"\")","v":""},{"$nulls":11},""]
[{"$nulls":3},25,"Total Comprehensive income for the period attributable to",{"$nulls":13},""]
[{"$nulls":4},"Comprehensive income for the period attributable to owners of parent",{"v":0,"d":"0.000"},{"$f":"+IF(COUNT(F59),+F59,\"\")","v":{"v":0,"d":"0.000"}},{"$nulls":11},0]
[{"$nulls":4},"Total comprehensive income for the period attributable to owners of parent non-controlling interests",{"v":0,"d":"0.000"},{"$f":"+IF(COUNT(F60),+F60,\"\")","v":{"v":0,"d":"0.000"}},{"$nulls":11},0]
[{"$nulls":3},26,"Details of equity share capital",{"$nulls":13},""]
[{"$nulls":4},"Paid-up equity share capital",{"$nulls":13},""]
[{"$nulls":4},"Face value of equity share capital",{"$nulls":13},""]
[{"$nulls":3},27,"Details of debt securities",{"$nulls":13},""]
[{"$nulls":4},"Paid-up debt capital",{"$nulls":13},""]
[{"$nulls":4},"Face value of debt securities",{"$nulls":13},""]
[{"$nulls":3},28,"Reserves excluding revaluation reserve",{"$nulls":13},""]
[{"$nulls":3},29,"Debenture redemption reserve",{"$nulls":13},""]
[{"$nulls":3},30,"Earnings per share",{"$nulls":13},""]
[{"$nulls":3},"i","Earnings per equity share for continuing operations",{"$nulls":13},""]
[{"$nulls":4},"Basic earnings (loss) per share from continuing operations",{"v":0.4,"d":"0.400"},{"$f":"+IF(COUNT(F71),+F71,\"\")","v":{"v":0.4,"d":"0.400"}},{"$nulls":11},0.4]
[{"$nulls":4},"Diluted earnings (loss) per share from continuing operations",{"v":0.4,"d":"0.400"},{"$f":"+IF(COUNT(F72),+F72,\"\")","v":{"v":0.4,"d":"0.400"}},{"$nulls":11},0.4]
[{"$nulls":3},"ii","Earnings per equity share for discontinued operations",{"$nulls":13},""]
[{"$nulls":4},"Basic earnings (loss) per share from discontinued operations",{"v":0,"d":"0.000"},{"$f":"+IF(COUNT(F74),+F74,\"\")","v":{"v":0,"d":"0.000"}},{"$nulls":11},0]
[{"$nulls":4},"Diluted earnings (loss) per share from discontinued operations",{"v":0,"d":"0.000"},{"$f":"+IF(COUNT(F75),+F75,\"\")","v":{"v":0,"d":"0.000"}},{"$nulls":11},0]
[{"$nulls":3},"ii","Earnings per equity share",{"$nulls":13},""]
[{"$nulls":4},"Basic earnings (loss) per share from continuing and discontinued operations",{"$f":"+IF(COUNT(F71,F74),SUM(F71,F74),\"\")","v":{"v":0.4,"d":"0.400"}},{"$f":"+IF(COUNT(G71,G74),SUM(G71,G74),\"\")","v":{"v":0.4,"d":"0.400"}},{"$nulls":11},0.4]
[{"$nulls":4},"Diluted earnings (loss) per share from continuing and discontinued operations",{"$f":"+IF(COUNT(F72,F75),SUM(F72,F75),\"\")","v":{"v":0.4,"d":"0.400"}},{"$f":"+IF(COUNT(G72,G75),SUM(G72,G75),\"\")","v":{"v":0.4,"d":"0.400"}},{"$nulls":11},0.4]
[{"$nulls":3},31,"Debt equity ratio",{"$nulls":13},""]
[{"$nulls":3},32,"Debt service coverage ratio",{"$nulls":13},""]
[{"$nulls":3},33,"Interest service coverage ratio",{"$nulls":13},{"$f":"+IF(COUNT(F81),+F81,\"\")","v":""}]
[{"$nulls":3},34,"Disclosure of notes on financial results"]

{"sheet":"Asset Liabilities","index":3,"n_rows":85,"n_cols":15,"rows_kept":85,"hidden":true,"merged":[[7,3,7,6],[8,3,8,4],[9,3,9,4],[10,3,10,4],[11,3,11,4],[12,3,12,4],[13,3,13,6],[14,5,14,6],[15,5,15,6],[24,5,24,6],[33,5,33,6],[35,5,35,6],[49,5,49,6],[50,5,50,6],[51,5,51,6],[57,5,57,6],[58,5,58,6],[59,5,59,6],[69,5,69,6],[70,5,70,6]]}
{"$rows_empty":7}
[{"$nulls":3},"Statement of Asset and Liabilities"]
[{"$nulls":3},"Particulars",null,"Current year ended        (dd-mm-yyyy)","Previous year ended                (dd-mm-yyyy)"]
[{"$nulls":3},"Date of start of reporting period"]
[{"$nulls":3},"Date of end of reporting period"]
[{"$nulls":3},"Whether results are audited or unaudited",{"$nulls":10},"Audited"]
[{"$nulls":3},"Nature of report standalone or consolidated",null,{"$f":"+IF(COUNTA('General Info'!E20),'General Info'!E20,\"\")","v":"Consolidated"},{"$f":"+IF(COUNTA('General Info'!E20),'General Info'!E20,\"\")","v":"Consolidated"},{"$nulls":7},"Unaudited"]
[]
[{"$nulls":4},"  Assets"]
[{"$nulls":3},1,"    Non-current assets"]
[{"$nulls":4},"Property, plant and equipment"]
[{"$nulls":4},"Capital work-in-progress"]
[{"$nulls":4},"Investment property"]
[{"$nulls":4},"Goodwill"]
[{"$nulls":4},"Other intangible assets"]
[{"$nulls":4},"Intangible assets under development"]
[{"$nulls":4},"Biological assets other than bearer plants"]
[{"$nulls":4},"Investments accounted for using equity method"]
[{"$nulls":4},"Non-current financial assets"]
[{"$nulls":4},"Non-current investments"]
[{"$nulls":4},"Trade receivables, non-current"]
[{"$nulls":4},"Loans, non-current"]
[{"$nulls":4},"Other non-current financial assets"]
[{"$nulls":4},"Total non-current financial assets",{"$f":"IF(COUNT(F26:F29),SUM(F26:F29),\"\")","v":""},{"$f":"IF(COUNT(G26:G29),SUM(G26:G29),\"\")","v":""}]
[{"$nulls":4},"Deferred tax assets (net)"]
[{"$nulls":4},"Other non-current assets"]
[{"$nulls":4},"Total non-current assets",{"$f":"IF(COUNT(F17:F24,F26:F29,F31:F32),SUM(F17:F24,F26:F29,F31:F32),\"\")","v":""},{"$f":"IF(COUNT(G17:G24,G26:G29,G31:G32),SUM(G17:G24,G26:G29,G31:G32),\"\")","v":""}]
[{"$nulls":3},2,"Current assets"]
[{"$nulls":4},"Inventories"]
[{"$nulls":4},"Current financial asset"]
[{"$nulls":4},"Current investments"]
[{"$nulls":4},"Trade receivables, current"]
[{"$nulls":4},"Cash and cash equivalents"]
[{"$nulls":4},"Bank balance other than cash and cash equivalents"]
[{"$nulls":4},"Loans, current"]
[{"$nulls":4},"Other current financial assets"]
[{"$nulls":4},"Total current financial assets",{"$f":"IF(COUNT(F37:F42),SUM(F37:F42),\"\")","v":""},{"$f":"IF(COUNT(G37:G42),SUM(G37:G42),\"\")","v":""}]
[{"$nulls":4},"Current tax assets (net)"]
[{"$nulls":4},"Other current assets"]
[{"$nulls":4},"Total current assets",{"$f":"IF(COUNT(F35,F37:F42,F44:F45),SUM(F35,F37:F42,F44:F45),\"\")","v":""},{"$f":"IF(COUNT(G35,G37:G42,G44:G45),SUM(G35,G37:G42,G44:G45),\"\")","v":""}]
[{"$nulls":3},3,"Non-current assets classified as held for sale"]
[{"$nulls":3},4,"Regulatory deferral account debit balances and related deferred tax Assets"]
[{"$nulls":4},"Total assets",{"$f":"IF(COUNT(F33,F46:F48),SUM(F33,F46:F48),\"\")","v":""},{"$f":"IF(COUNT(G33,G46:G48),SUM(G33,G46:G48),\"\")","v":""}]
[{"$nulls":4},"Equity and liabilities"]
[{"$nulls":3},1,"Equity"]
[{"$nulls":4},"Equity attributable to owners of parent"]
[{"$nulls":4},"Equity share capital"]
[{"$nulls":4},"Other equity"]
[{"$nulls":4},"Total equity attributable to owners of parent",{"$f":"IF(COUNT(F53:F54),SUM(F53:F54),\"\")","v":""},{"$f":"IF(COUNT(G53:G54),SUM(G53:G54),\"\")","v":""}]
[{"$nulls":4},"Non controlling interest"]
[{"$nulls":4},"Total equity",{"$f":"IF(COUNT(F55:F56),SUM(F55:F56),\"\")","v":""},{"$f":"IF(COUNT(G55:G56),SUM(G55:G56),\"\")","v":""}]
[{"$nulls":3},2,"Liabilities"]
[{"$nulls":4},"Non-current liabilities"]
[{"$nulls":4},"Non-current financial liabilities"]
[{"$nulls":4},"Borrowings, non-current"]
[{"$nulls":4},"  Trade payables, non-current"]
[{"$nulls":4},"Other non-current financial liabilities"]
[{"$nulls":4},"Total non-current financial liabilities",{"$f":"IF(COUNT(F61:F63),SUM(F61:F63),\"\")","v":""},{"$f":"IF(COUNT(G61:G63),SUM(G61:G63),\"\")","v":""}]
[{"$nulls":4},"Provisions, non-current"]
[{"$nulls":4},"Deferred tax liabilities (net)"]
[{"$nulls":4},"Deferred government grants, Non-current"]
[{"$nulls":4},"Other non-current liabilities"]
[{"$nulls":4},"Total non-current liabilities",{"$f":"IF(COUNT(F61:F63,F65:F68),SUM(F61:F63,F65:F68),\"\")","v":""},{"$f":"IF(COUNT(G61:G63,G65:G68),SUM(G61:G63,G65:G68),\"\")","v":""}]
[{"$nulls":4},"Current liabilities"]
[{"$nulls":4},"Current financial liabilities"]
[{"$nulls":4},"Borrowings, current"]
[{"$nulls":4},"Trade payables, current"]
[{"$nulls":4},"Other current financial liabilities"]
[{"$nulls":4},"Total current financial liabilities",{"$f":"IF(COUNT(F72:F74),SUM(F72:F74),\"\")","v":""},{"$f":"IF(COUNT(G72:G74),SUM(G72:G74),\"\")","v":""}]
[{"$nulls":4},"Other current liabilities"]
[{"$nulls":4},"Provisions, current"]
[{"$nulls":4},"Current tax liabilities (Net)"]
[{"$nulls":4},"Deferred government grants, Current"]
[{"$nulls":4},"Total current liabilities",{"$f":"IF(COUNT(F72:F74,F76:F79),SUM(F72:F74,F76:F79),\"\")","v":""},{"$f":"IF(COUNT(G72:G74,G76:G79),SUM(G72:G74,G76:G79),\"\")","v":""}]
[{"$nulls":3},3,"Liabilities directly associated with assets in disposal group classified as held for sale"]
[{"$nulls":3},4,"Regulatory deferral account credit balances and related deferred tax liability"]
[{"$nulls":4},"Total liabilities",{"$f":"IF(COUNT(F69,F80,F81:F82),SUM(F69,F80,F81:F82),\"\")","v":""},{"$f":"IF(COUNT(G69,G80,G81:G82),SUM(G69,G80,G81:G82),\"\")","v":""}]
[{"$nulls":4},"Total equity and liabilites",{"$f":"IF(COUNT(F57,F83),SUM(F57,F83),\"\")","v":""},{"$f":"IF(COUNT(G57,G83),SUM(G57,G83),\"\")","v":""}]
[{"$nulls":4},"Disclosure of notes on assets and liabilities"]

{"sheet":"Segment","index":4,"n_rows":75,"n_cols":19,"rows_kept":75,"merged":[[7,3,7,6],[8,3,8,4],[9,3,9,4],[10,3,10,4],[11,3,11,4],[12,3,12,4],[13,5,13,6],[14,5,14,6],[34,5,34,6],[35,5,35,6],[56,5,56,6],[57,5,57,6]]}
{"$rows_empty":7}
[{"$nulls":3},"Format for Reporting Segmenet wise Revenue, Results and Capital Employed along with the company results"]
[{"$nulls":3},"Particulars",null,"3 months/ 6 month ended (dd-mm-yyyy)","Year to date figures for current period ended                (dd-mm-yyyy)"]
[{"$nulls":3},"Date of start of reporting period",null,"01-04-2017","01-04-2017"]
[{"$nulls":3},"Date of end of reporting period",null,"30-06-2017","30-06-2017"]
[{"$nulls":3},"Whether accounts are audited or unaudited",null,"Unaudited","Unaudited",{"$nulls":7},"Audited"]
[{"$nulls":3},"Nature of report standalone or consolidated",null,{"$f":"+IF(COUNTA('General Info'!E20),'General Info'!E20,\"\")","v":"Consolidated"},{"$f":"+IF(COUNTA('General Info'!E20),'General Info'!E20,\"\")","v":"Consolidated"},{"$nulls":7},"Unaudited"]
[{"$nulls":3},1,"Segment Revenue (Income) "]
[{"$nulls":4},"(net sale/income from each segment should be disclosed)"]
[{"$nulls":3},1,"JEWELLERY",{"v":9552.43,"d":"9552.430"},{"$f":"+IF(COUNT(F16),+F16,\"\")","v":{"v":9552.43,"d":"9552.430"}},{"$nulls":11},{"$f":"+IF(COUNT(F16),+F16,\"\")","v":9552.43}]
[{"$nulls":3},2,"REALTY",{"v":31.54,"d":"31.540"},{"v":31.54,"d":"31.540"},{"$nulls":11},{"$f":"+IF(COUNT(F17),+F17,\"\")","v":31.54}]
[{"$nulls":3},3,null,null,"",{"$nulls":11},""]
[{"$nulls":3},4,null,null,"",{"$nulls":11},""]
[{"$nulls":3},5,null,null,"",{"$nulls":11},""]
[{"$nulls":3},6,null,null,"",{"$nulls":11},""]
[{"$nulls":3},7,null,null,"",{"$nulls":11},""]
[{"$nulls":3},8,null,null,"",{"$nulls":11},""]
[{"$nulls":3},9,null,null,"",{"$nulls":11},""]
[{"$nulls":3},10,null,null,"",{"$nulls":11},""]
[{"$nulls":3},11,null,null,"",{"$nulls":11},""]
[{"$nulls":3},12,null,null,"",{"$nulls":11},""]
[{"$nulls":3},13,null,null,"",{"$nulls":11},""]
[{"$nulls":3},14,null,null,"",{"$nulls":11},""]
[{"$nulls":3},15,null,null,"",{"$nulls":11},""]
[{"$nulls":4},"Total Segment Revenue",{"$f":"+IF(COUNT(F16:F30),SUM(F16:F30),\"\")","v":{"v":9583.970000000001,"d":"9583.970"}},{"$f":"+IF(COUNT(G16:G30),SUM(G16:G30),\"\")","v":{"v":9583.970000000001,"d":"9583.970"}},{"$nulls":11},9583.970000000001]
[{"$nulls":4},"Less: Inter segment revenue",{"v":26.77,"d":"26.770"},{"$f":"+IF(COUNT(F32),+F32,\"\")","v":{"v":26.77,"d":"26.770"}},{"$nulls":11},26.77]
[{"$nulls":4},"Revenue  from  operations ",{"$f":"+IF(COUNT(F31:F32),SUM(F31)-SUM(F32),\"\")","v":{"v":9557.2,"d":"9557.200"}},{"$f":"+IF(COUNT(G31:G32),SUM(G31)-SUM(G32),\"\")","v":{"v":9557.2,"d":"9557.200"}},{"$nulls":11},9557.2]
[{"$nulls":18},""]
[{"$nulls":3},2,"Segment Result",{"$nulls":13},""]
[{"$nulls":4},"Profit (+) / Loss (-) before tax and interest from each segment",{"$nulls":13},""]
[{"$nulls":3},1,{"$f":"+IF(COUNTA(E16),+E16,\"\")","v":"JEWELLERY"},{"v":116.42,"d":"116.420"},{"$f":"+IF(COUNT(F37),+F37,\"\")","v":{"v":116.42,"d":"116.420"}},{"$nulls":11},116.42]
[{"$nulls":3},2,{"$f":"+IF(COUNTA(E17),+E17,\"\")","v":"REALTY"},{"v":4.3,"d":"4.300"},{"v":4.3,"d":"4.300"},{"$nulls":11},4.3]
[{"$nulls":3},3,"",null,"",{"$nulls":11},""]
[{"$nulls":3},4,"",null,"",{"$nulls":11},""]
[{"$nulls":3},5,"",null,"",{"$nulls":11},""]
[{"$nulls":3},6,"",null,"",{"$nulls":11},""]
[{"$nulls":3},7,"",null,"",{"$nulls":11},""]
[{"$nulls":3},8,"",null,"",{"$nulls":11},""]
[{"$nulls":3},9,"",null,"",{"$nulls":11},""]
[{"$nulls":3},10,"",null,"",{"$nulls":11},""]
[{"$nulls":3},11,"",null,"",{"$nulls":11},""]
[{"$nulls":3},12,"",null,"",{"$nulls":11},""]
[{"$nulls":3},13,"",null,"",{"$nulls":11},""]
[{"$nulls":3},14,"",null,"",{"$nulls":11},""]
[{"$nulls":3},15,"",null,"",{"$nulls":11},""]
[{"$nulls":4},"Total  Profit  before tax",{"$f":"+IF(COUNT(F37:F51),SUM(F37:F51),\"\")","v":{"v":120.72,"d":"120.720"}},{"$f":"+IF(COUNT(G37:G51),SUM(G37:G51),\"\")","v":{"v":120.72,"d":"120.720"}},{"$nulls":11},120.72]
[{"$nulls":4},"i. Finance cost",{"v":0,"d":"0.000"},{"$f":"+IF(COUNT(F53),+F53,\"\")","v":{"v":0,"d":"0.000"}},{"$nulls":11},0]
[{"$nulls":4},"ii. Other Unallocable Expenditure net off Unallocable income",{"v":0,"d":"0.000"},{"$f":"+IF(COUNT(F54),+F54,\"\")","v":{"v":0,"d":"0.000"}},{"$nulls":11},0]
[{"$nulls":4},"Profit  before  tax ",{"$f":"+IF(COUNT(F52:F54),SUM(F52)-SUM(F53)-SUM(F54),\"\")","v":{"v":120.72,"d":"120.720"}},{"$f":"+IF(COUNT(G52:G54),SUM(G52)-SUM(G53)-SUM(G54),\"\")","v":{"v":120.72,"d":"120.720"}},{"$nulls":11},120.72]
[{"$nulls":18},""]
[{"$nulls":3},3,"Capital Employed ",{"$nulls":13},""]
[{"$nulls":4},"(Segment Asset - Segment Liabilities)",{"$nulls":13},""]
[{"$nulls":3},{"$f":"+D58+1","v":1},{"$f":"+IF(COUNTA(E16),+E16,\"\")","v":"JEWELLERY"},{"v":8681.97,"d":"8681.970"},{"$f":"+IF(COUNT(F59),+F59,\"\")","v":{"v":8681.97,"d":"8681.970"}},{"$nulls":11},8681.97]
[{"$nulls":3},2,"REALTY",{"v":1017.2,"d":"1017.200"},{"v":1017.2,"d":"1017.200"},{"$nulls":11},1017.2]
[{"$nulls":3},3,"",null,"",{"$nulls":11},""]
[{"$nulls":3},4,"",null,"",{"$nulls":11},""]
[{"$nulls":3},5,"",null,"",{"$nulls":11},""]
[{"$nulls":3},6,"",null,"",{"$nulls":11},""]
[{"$nulls":3},7,"",null,"",{"$nulls":11},""]
[{"$nulls":3},8,"",null,"",{"$nulls":11},""]
[{"$nulls":3},9,"",null,"",{"$nulls":11},""]
[{"$nulls":3},{"$f":"+D67+1","v":10},"",null,"",{"$nulls":11},""]
[{"$nulls":3},11,"",null,"",{"$nulls":11},""]
[{"$nulls":3},12,"",null,"",{"$nulls":11},""]
[{"$nulls":3},13,"",null,"",{"$nulls":11},""]
[{"$nulls":3},14,"",null,"",{"$nulls":11},""]
[{"$nulls":3},15,"",null,"",{"$nulls":11},""]
[{"$nulls":4},"Total capital employed",{"$f":"+IF(COUNT(F59:F73),SUM(F59:F73),\"\")","v":{"v":9699.17,"d":"9699.170"}},{"$f":"+IF(COUNT(G59:G73),SUM(G59:G73),\"\")","v":{"v":9699.17,"d":"9699.170"}}]
[{"$nulls":4},"Disclosure of notes on segments"]

{"sheet":"TextBlock","index":5,"n_rows":1,"n_cols":5,"rows_kept":1,"hidden":true}
[{"$nulls":4},2]

{"sheet":"OCI","index":6,"n_rows":21,"n_cols":19,"rows_kept":21,"merged":[[5,1,5,4],[6,1,6,2],[11,3,11,4],[12,3,12,4],[16,3,16,4]]}
[{"$nulls":4},0,0,0]
[{"$nulls":4},{"$f":"+IF(COUNT(D2),D2,\"\")","v":""},{"$nulls":13},{"$f":"+IF(COUNT(D2),D2,\"\")","v":""}]
[]
[]
[]
[null,"Other Comprehensive Income"]
[null,"Particulars",null,"3 months/ 6 month ended         (dd-mm-yyyy)","Year to date figures for current period ended                              (dd-mm-yyyy)"]
[null,"A","Date of start of reporting period","01-04-2017","01-04-2017"]
[null,"B","Date of end of reporting period","30-06-2017","30-06-2017"]
[null,"C","Whether results are audited or unaudited",{"$f":"+IF(COUNTA('Financial Results'!F12),'Financial Results'!F12,\"\")","v":"Unaudited"},{"$f":"+IF(COUNTA('Financial Results'!G12),'Financial Results'!G12,\"\")","v":"Unaudited"}]
[null,"D","Nature of report standalone or consolidated",{"$f":"+IF(COUNTA('Financial Results'!F13),'Financial Results'!F13,\"\")","v":"Consolidated"},{"$f":"+IF(COUNTA('Financial Results'!G13),'Financial Results'!G13,\"\")","v":"Consolidated"}]
[null,null,"Other comprehensive income [Abstract]"]
[null,1,"Amount of items that will not be reclassified to profit and loss"]
[]
[null,null,"Total Amount of items that will not be reclassified to profit and loss",{"$f":"IF(COUNT(D13:D14),SUM(D13:D14),\"\")","v":""},{"$f":"IF(COUNT(E13:E14),SUM(E13:E14),\"\")","v":""}]
[null,2,"Income tax relating to items that will not be reclassified to profit or loss "]
[null,3,"Amount of items that will be reclassified to profit and loss"]
[]
[null,null,"Total Amount of items that will be reclassified to profit and loss",{"$f":"IF(COUNT(D17:D18),SUM(D17:D18),\"\")","v":""},{"$f":"IF(COUNT(E17:E18),SUM(E17:E18),\"\")","v":""}]
[null,4,"Income tax relating to items that will be reclassified to profit or loss "]
[null,5,"Total Other comprehensive income",{"$f":"IF(COUNT(D15,D16,D19,D20),SUM(D15)-SUM(D16)+SUM(D19)-SUM(D20),\"\")","v":""},{"$f":"IF(COUNT(E15,E16,E19,E20),SUM(E15)-SUM(E16)+SUM(E19)-SUM(E20),\"\")","v":""}]

{"sheet":"Taxonomy","index":7,"n_rows":165,"n_cols":19,"rows_kept":165,"hidden":true}
["Prefix","label","name","Label",null,"order","ID","label1","label2","ScheduleName","type","enumerations","substitutionGroup","balance","periodType","abstract","nillable","Bussiness Rule"]
["in-bse-fin","GeneralInformationAbstract","General information [Abstract]",{"$nulls":7},"xbrli:stringItemType",{"$nulls":3},"duration"]
["in-bse-fin","ScripCode","Scrip code","Scrip code",{"$nulls":6},"in-bse-fin-types:ScripCode",{"$nulls":3},"duration",{"$nulls":3},"This is a mandatory field. Should be valid SCRIP CODE  as per BSE Scrip Code Format. "]
["in-bse-fin","NameOfTheCompany","Name of the company","Name of company",{"$nulls":6},"xbrli:stringItemType",{"$nulls":3},"duration"]
["in-bse-fin","ResultType","Result Type","Result Type",{"$nulls":6},"xbrli:stringItemType",{"$nulls":3},"duration"]
["in-bse-fin","ClassOfSecurity","Class of security","Class of security",{"$nulls":6},"in-bse-fin-types:ClassOfSecurity",{"$nulls":3},"duration"]
["in-bse-fin","DateOfBoardMeetingWhenFinancialResultsWereApproved","Date of board meeting when results were approved","Date of board meeting when results were approved",{"$nulls":6},"xbrli:dateItemType",{"$nulls":3},"duration"]
["in-bse-fin","DateOnWhichPriorIntimationOfTheMeetingForConsideringFinancialResultsWasInformedToTheExchange","Date on which prior intimation of the meeting for considering financial results was informed to the exchange","Date on which prior intimation of the meeting for considering financial results was informed to the exchange",{"$nulls":6},"xbrli:dateItemType",{"$nulls":3},"duration"]
["in-bse-fin","DateOfStartOfReportingPeriod","Date of start of reporting period","Date of start of reporting period",{"$nulls":6},"xbrli:dateItemType",{"$nulls":3},"duration"]
["in-bse-fin","DateOfEndOfReportingPeriod","Date of end of reporting period","Date of end of reporting period",{"$nulls":6},"xbrli:dateItemType",{"$nulls":3},"duration"]
["in-bse-fin","DateOfStartOfFinancialYear","Date of start of Quarter","Date of start of financial year",{"$nulls":6},"xbrli:dateItemType",{"$nulls":3},"duration"]
["in-bse-fin","DateOfEndOfFinancialYear","Date of end of Quarter","Date of end of financial year",{"$nulls":6},"xbrli:dateItemType",{"$nulls":3},"duration"]
["in-bse-fin","NatureOfReportStandaloneConsolidated","Nature of report standalone or consolidated","Nature of report standalone or consolidated",{"$nulls":6},"xbrli:stringItemType",{"$nulls":3},"duration"]
["in-bse-fin","ReportingQuarter","Reporting Quarter","Reporting Quarter",{"$nulls":6},"xbrli:stringItemType",{"$nulls":3},"duration"]
["in-bse-fin","DescriptionOfPresentationCurrency","Description of presentation currency","Description of presentation currency",{"$nulls":6},"xbrli:stringItemType",{"$nulls":3},"duration"]
["in-bse-fin","LevelOfRoundingUsedInFinancialStatements","Level of rounding used in financial statements","Level of rounding used in financial results",{"$nulls":6},"in-ca-types:LevelOfRounding",{"$nulls":3},"duration"]
["in-bse-fin","WhetherResultsAreAuditedOrUnaudited","Whether results are audited or unaudited","Whether results are audited or unaudited",{"$nulls":6},"xbrli:stringItemType",{"$nulls":3},"duration"]
["in-bse-fin","IsCompanyReportingMultisegmentOrSingleSegment","Is company reporting multisegment or single segment","Segment Reporting",{"$nulls":6},"xbrli:stringItemType",{"$nulls":3},"duration"]
["in-bse-fin","DescriptionOfSingleSegment","Description of single segment","Description of single segment",{"$nulls":6},"xbrli:stringItemType",{"$nulls":3},"duration",{"$nulls":3},"This is a mandatory field as \"Single Segment\" selected in Segement Reporting field."]
["in-bse-fin","StartTimeOfBoardMeeting",null,"Start time of board meeting",{"$nulls":6},"xbrli:timeItemType",{"$nulls":3},"duration"]
["in-bse-fin","EndTimeOfBoardMeeting",null,"End time of board meeting",{"$nulls":6},"xbrli:timeItemType",{"$nulls":3},"duration"]
["in-bse-fin","DisclosuresRelatingToSegmentAbstract","Disclosures relating to segment [Abstract]",{"$nulls":7},"xbrli:stringItemType",{"$nulls":3},"duration"]
["in-bse-fin","DescriptionOfReportableSegment","Description Of Reportable Segment",{"$nulls":7},"xbrli:stringItemType",{"$nulls":3},"duration"]
["in-bse-fin","SegmentRevenue","Segment revenue","Segment revenue",{"$nulls":6},"xbrli:monetaryItemType",{"$nulls":3},"duration"]
["in-bse-fin","SegmentRevenue","Total segment revenue","Total Segment Revenue",{"$nulls":6},"xbrli:monetaryItemType",{"$nulls":3},"duration"]
["in-bse-fin","InterSegmentRevenue","Inter segment revenue","Less: Inter segment revenue",{"$nulls":6},"xbrli:monetaryItemType",{"$nulls":3},"duration"]
["in-bse-fin","SegmentRevenueFromOperations","Revenue from Operations","Revenue  from  operations ",{"$nulls":6},"xbrli:monetaryItemType",{"$nulls":3},"duration"]
["in-bse-fin","DisclosuresRelatingToSegmentResultLineItems","Disclosures relating to segment result [LineItems]",{"$nulls":7},"xbrli:stringItemType",{"$nulls":3},"duration"]
["in-bse-fin","DescriptionOfReportableSegment","Description Of Reportable Segment",{"$nulls":7},"xbrli:stringItemType",{"$nulls":3},"duration"]
["in-bse-fin","SegmentProfitLossBeforeTaxAndFinanceCosts","Segment profit (loss) before tax and interest","Profit (loss) before tax and interest",{"$nulls":6},"xbrli:monetaryItemType",{"$nulls":3},"duration"]
["in-bse-fin","SegmentFinanceCosts","Interest","i. Finance cost",{"$nulls":6},"xbrli:monetaryItemType",{"$nulls":3},"duration"]
["in-bse-fin","OtherUnallocableExpenditureNetOffUnAllocableIncome","Other Unallocable Expenditure net off Un-allocable income","ii. Other Unallocable Expenditure net off Unallocable income",{"$nulls":6},"xbrli:monetaryItemType",{"$nulls":3},"duration"]
["in-bse-fin","DisclosuresRelatingToSegmentCapitalEmployedLineItems","Disclosures relating to segment Segment capital employed [Line Items]",{"$nulls":7},"xbrli:stringItemType",{"$nulls":3},"duration"]
["in-bse-fin","DescriptionOfReportableSegment","Description Of Reportable Segment","Description Of reportable segments",{"$nulls":6},"xbrli:stringItemType",{"$nulls":3},"duration"]
["in-bse-fin","CapitalEmployed","Capital Employed","Capital Employed",{"$nulls":6},"xbrli:monetaryItemType",{"$nulls":3},"duration"]
["in-bse-fin","CapitalEmployed","Total capital employed","Total capital employed",{"$nulls":6},"xbrli:monetaryItemType",{"$nulls":3},"duration"]
["in-bse-fin","DisclosureOfNotesOnSegmentsExplanatoryTextBlock","Disclosure of notes on segments","Disclosure of notes on segments",{"$nulls":6},"nonnum:textBlockItemType",{"$nulls":3},"duration"]
["in-bse-fin","StatementOfAssetsAndLiabilitiesAbstract","Statement of assets and liabilities [Abstract]",{"$nulls":7},"xbrli:stringItemType",{"$nulls":3},"duration"]
["in-bse-fin","PropertyPlantAndEquipment",null,"Property, plant and equipment",{"$nulls":6},"xbrli:monetaryItemType",{"$nulls":3},"instant"]
["in-bse-fin","CapitalWorkInProgress",null,"Capital work-in-progress",{"$nulls":6},"xbrli:monetaryItemType",{"$nulls":3},"instant"]
["in-bse-fin","InvestmentProperty",null,"Investment property",{"$nulls":6},"xbrli:monetaryItemType",{"$nulls":3},"instant"]
["in-bse-fin","Goodwill",null,"Goodwill",{"$nulls":6},"xbrli:monetaryItemType",{"$nulls":3},"instant"]
["in-bse-fin","OtherIntangibleAssets",null,"Other intangible assets",{"$nulls":6},"xbrli:monetaryItemType",{"$nulls":3},"instant"]
["in-bse-fin","IntangibleAssetsUnderDevelopment",null,"Intangible assets under development",{"$nulls":6},"xbrli:monetaryItemType",{"$nulls":3},"instant"]
["in-bse-fin","BiologicalAssetsOtherThanBearerPlants",null,"Biological assets other than bearer plants",{"$nulls":6},"xbrli:monetaryItemType",{"$nulls":3},"instant"]
["in-bse-fin","InvestmentsAccountedForUsingEquityMethod",null,"Investments accounted for using equity method",{"$nulls":6},"xbrli:monetaryItemType",{"$nulls":3},"instant"]
["in-bse-fin","NoncurrentInvestments",null,"Non-current investments",{"$nulls":6},"xbrli:monetaryItemType",{"$nulls":3},"instant"]
["in-bse-fin","TradeReceivablesNoncurrent",null,"Trade receivables, non-current",{"$nulls":6},"xbrli:monetaryItemType",{"$nulls":3},"instant"]
["in-bse-fin","LoansNoncurrent",null,"Loans, non-current",{"$nulls":6},"xbrli:monetaryItemType",{"$nulls":3},"instant"]
["in-bse-fin","OtherNoncurrentFinancialAssets",null,"Other non-current financial assets",{"$nulls":6},"xbrli:monetaryItemType",{"$nulls":3},"instant"]
["in-bse-fin","NoncurrentFinancialAssets",null,"Total non-current financial assets",{"$nulls":6},"xbrli:monetaryItemType",{"$nulls":3},"instant"]
["in-bse-fin","DeferredTaxAssetsNet",null,"Deferred tax assets (net)",{"$nulls":6},"xbrli:monetaryItemType",{"$nulls":3},"instant"]
["in-bse-fin","OtherNoncurrentAssets",null,"Other non-current assets",{"$nulls":6},"xbrli:monetaryItemType",{"$nulls":3},"instant"]
["in-bse-fin","NoncurrentAssets",null,"Total non-current assets",{"$nulls":6},"xbrli:monetaryItemType",{"$nulls":3},"instant"]
["in-bse-fin","Inventories",null,"Inventories",{"$nulls":6},"xbrli:monetaryItemType",{"$nulls":3},"instant"]
["in-bse-fin","CurrentInvestments",null,"Current investments",{"$nulls":6},"xbrli:monetaryItemType",{"$nulls":3},"instant"]
["in-bse-fin","TradeReceivablesCurrent",null,"Trade receivables, current",{"$nulls":6},"xbrli:monetaryItemType",{"$nulls":3},"instant"]
["in-bse-fin","CashAndCashEquivalents",null,"Cash and cash equivalents",{"$nulls":6},"xbrli:monetaryItemType",{"$nulls":3},"instant"]
["in-bse-fin","BankBalanceOtherThanCashAndCashEquivalents",null,"Bank balance other than cash and cash equivalents",{"$nulls":6},"xbrli:monetaryItemType",{"$nulls":3},"instant"]
["in-bse-fin","LoansCurrent",null,"Loans, current",{"$nulls":6},"xbrli:monetaryItemType",{"$nulls":3},"instant"]
["in-bse-fin","OtherCurrentFinancialAssets",null,"Other current financial assets",{"$nulls":6},"xbrli:monetaryItemType",{"$nulls":3},"instant"]
["in-bse-fin","CurrentFinancialAssets",null,"Total current financial assets",{"$nulls":6},"xbrli:monetaryItemType",{"$nulls":3},"instant"]
["in-bse-fin","CurrentTaxAssets",null,"Current tax assets (net)",{"$nulls":6},"xbrli:monetaryItemType",{"$nulls":3},"instant"]
["in-bse-fin","OtherCurrentAssets",null,"Other current assets",{"$nulls":6},"xbrli:monetaryItemType",{"$nulls":3},"instant"]
["in-bse-fin","CurrentAssets",null,"Total current assets",{"$nulls":6},"xbrli:monetaryItemType",{"$nulls":3},"instant"]
["in-bse-fin","NoncurrentAssetsClassifiedAsHeldForSale",null,"Non-current assets classified as held for sale",{"$nulls":6},"xbrli:monetaryItemType",{"$nulls":3},"instant"]
["in-bse-fin","RegulatoryDeferralAccountDebitBalancesAndRelatedDeferredTaxAssets",null,"Regulatory deferral account debit balances and related deferred tax Assets",{"$nulls":6},"xbrli:monetaryItemType",{"$nulls":3},"instant"]
["in-bse-fin","Assets",null,"Total assets",{"$nulls":6},"xbrli:monetaryItemType",{"$nulls":3},"instant"]
["in-bse-fin","EquityShareCapital",null,"Equity share capital",{"$nulls":6},"xbrli:monetaryItemType",{"$nulls":3},"instant"]
["in-bse-fin","OtherEquity",null,"Other equity",{"$nulls":6},"xbrli:monetaryItemType",{"$nulls":3},"instant"]
["in-bse-fin","EquityAttributableToOwnersOfParent",null,"Total equity attributable to owners of parent",{"$nulls":6},"xbrli:monetaryItemType",{"$nulls":3},"instant"]
["in-bse-fin","NonControllingInterest",null,"Non controlling interest",{"$nulls":6},"xbrli:monetaryItemType",{"$nulls":3},"instant"]
["in-bse-fin","Equity",null,"Total equity",{"$nulls":6},"xbrli:monetaryItemType",{"$nulls":3},"instant"]
["in-bse-fin","BorrowingsNoncurrent",null,"Borrowings, non-current",{"$nulls":6},"xbrli:monetaryItemType",{"$nulls":3},"instant"]
["in-bse-fin","TradePayablesNoncurrent",null,"  Trade payables, non-current",{"$nulls":6},"xbrli:monetaryItemType",{"$nulls":3},"instant"]
["in-bse-fin","OtherNoncurrentFinancialLiabilities",null,"Other non-current financial liabilities",{"$nulls":6},"xbrli:monetaryItemType",{"$nulls":3},"instant"]
["in-bse-fin","NoncurrentFinancialLiabilities",null,"Total non-current financial liabilities",{"$nulls":6},"xbrli:monetaryItemType",{"$nulls":3},"instant"]
["in-bse-fin","ProvisionsNoncurrent",null,"Provisions, non-current",{"$nulls":6},"xbrli:monetaryItemType",{"$nulls":3},"instant"]
["in-bse-fin","DeferredTaxLiabilitiesNet",null,"Deferred tax liabilities (net)",{"$nulls":6},"xbrli:monetaryItemType",{"$nulls":3},"instant"]
["in-bse-fin","DeferredGovernmentGrantsNoncurrent",null,"Deferred government grants, Non-current",{"$nulls":6},"xbrli:monetaryItemType",{"$nulls":3},"instant"]
["in-bse-fin","OtherNoncurrentLiabilities",null,"Other non-current liabilities",{"$nulls":6},"xbrli:monetaryItemType",{"$nulls":3},"instant"]
["in-bse-fin","NoncurrentLiabilities",null,"Total non-current liabilities",{"$nulls":6},"xbrli:monetaryItemType",{"$nulls":3},"instant"]
["in-bse-fin","BorrowingsCurrent",null,"Borrowings, current",{"$nulls":6},"xbrli:monetaryItemType",{"$nulls":3},"instant"]
["in-bse-fin","TradePayablesCurrent",null,"Trade payables, current",{"$nulls":6},"xbrli:monetaryItemType",{"$nulls":3},"instant"]
["in-bse-fin","OtherCurrentFinancialLiabilities",null,"Other current financial liabilities",{"$nulls":6},"xbrli:monetaryItemType",{"$nulls":3},"instant"]
["in-bse-fin","CurrentFinancialLiabilities",null,"Total current financial liabilities",{"$nulls":6},"xbrli:monetaryItemType",{"$nulls":3},"instant"]
["in-bse-fin","OtherCurrentLiabilities",null,"Other current liabilities",{"$nulls":6},"xbrli:monetaryItemType",{"$nulls":3},"instant"]
["in-bse-fin","ProvisionsCurrent",null,"Provisions, current",{"$nulls":6},"xbrli:monetaryItemType",{"$nulls":3},"instant"]
["in-bse-fin","CurrentTaxLiabilities",null,"Current tax liabilities (Net)",{"$nulls":6},"xbrli:monetaryItemType",{"$nulls":3},"instant"]
["in-bse-fin","DeferredGovernmentGrantsCurrent",null,"Deferred government grants, Current",{"$nulls":6},"xbrli:monetaryItemType",{"$nulls":3},"instant"]
["in-bse-fin","CurrentLiabilities",null,"Total current liabilities",{"$nulls":6},"xbrli:monetaryItemType",{"$nulls":3},"instant"]
["in-bse-fin","LiabilitiesDirectlyAssociatedWithAssetsInDisposalGroupClassifiedAsHeldForSale",null,"Liabilities directly associated with assets in disposal group classified as held for sale",{"$nulls":6},"xbrli:monetaryItemType",{"$nulls":3},"instant"]
["in-bse-fin","RegulatoryDeferralAccountCreditBalancesAndRelatedDeferredTaxLiability",null,"Regulatory deferral account credit balances and related deferred tax liability",{"$nulls":6},"xbrli:monetaryItemType",{"$nulls":3},"instant"]
["in-bse-fin","Liabilities",null,"Total liabilities",{"$nulls":6},"xbrli:monetaryItemType",{"$nulls":3},"instant"]
["in-bse-fin","EquityAndLiabilities",null,"Total equity and liabilites",{"$nulls":6},"xbrli:monetaryItemType",{"$nulls":3},"instant"]
["in-bse-fin","RevenueFromOperations",null,"Revenue from operations",{"$nulls":6},"xbrli:monetaryItemType",{"$nulls":3},"duration"]
["in-bse-fin","OtherIncome",null,"Other income",{"$nulls":6},"xbrli:monetaryItemType",{"$nulls":3},"duration"]
["in-bse-fin","Income",null,"Total income",{"$nulls":6},"xbrli:monetaryItemType",{"$nulls":3},"duration"]
["in-bse-fin","CostOfMaterialsConsumed",null,"Cost of materials consumed",{"$nulls":6},"xbrli:monetaryItemType",{"$nulls":3},"duration"]
["in-bse-fin","PurchasesOfStockInTrade",null,"Purchases of stock-in-trade",{"$nulls":6},"xbrli:monetaryItemType",{"$nulls":3},"duration"]
["in-bse-fin","ChangesInInventoriesOfFinishedGoodsWorkInProgressAndStockInTrade",null,"Changes in inventories of finished goods, work-in-progress and stock-in-trade",{"$nulls":6},"xbrli:monetaryItemType",{"$nulls":3},"duration"]
["in-bse-fin","EmployeeBenefitExpense",null,"Employee benefit expense  ",{"$nulls":6},"xbrli:monetaryItemType",{"$nulls":3},"duration"]
["in-bse-fin","FinanceCosts",null,"Finance costs",{"$nulls":6},"xbrli:monetaryItemType",{"$nulls":3},"duration"]
["in-bse-fin","DepreciationDepletionAndAmortisationExpense",null,"Depreciation, depletion and amortisation expense",{"$nulls":6},"xbrli:monetaryItemType",{"$nulls":3},"duration"]
["in-bse-fin","OtherExpenses",null,"Total other expenses",{"$nulls":6},"xbrli:monetaryItemType",{"$nulls":3},"duration"]
["in-bse-fin","Expenses",null,"Total  expenses",{"$nulls":6},"xbrli:monetaryItemType",{"$nulls":3},"duration"]
["in-bse-fin","ProfitBeforeExceptionalItemsAndTax",null,"Total profit before exceptional items and tax",{"$nulls":6},"xbrli:monetaryItemType",{"$nulls":3},"duration"]
["in-bse-fin","ExceptionalItemsBeforeTax",null,"Exceptional items ",{"$nulls":6},"xbrli:monetaryItemType",{"$nulls":3},"duration"]
["in-bse-fin","ProfitBeforeTax",null,"Total profit before tax",{"$nulls":6},"xbrli:monetaryItemType",{"$nulls":3},"duration"]
["in-bse-fin","CurrentTax",null,"Current tax",{"$nulls":6},"xbrli:monetaryItemType",{"$nulls":3},"duration"]
["in-bse-fin","DeferredTax",null,"Deferred tax",{"$nulls":6},"xbrli:monetaryItemType",{"$nulls":3},"duration"]
["in-bse-fin","TaxExpense",null,"Total tax expenses",{"$nulls":6},"xbrli:monetaryItemType",{"$nulls":3},"duration"]
["in-bse-fin","NetMovementInRegulatoryDeferralAccountBalancesRelatedToProfitOrLossAndTheRelatedDeferredTaxMovement",null,"Net movement in regulatory deferral account balances related to profit or loss and the related deferred tax movement",{"$nulls":6},"xbrli:monetaryItemType",{"$nulls":3},"duration"]
["in-bse-fin","ProfitLossForPeriodFromContinuingOperations",null,"Net Profit Loss for the period from continuing operations",{"$nulls":6},"xbrli:monetaryItemType",{"$nulls":3},"duration"]
["in-bse-fin","ProfitLossFromDiscontinuedOperationsBeforeTax",null,"Profit (loss) from discontinued operations before tax",{"$nulls":6},"xbrli:monetaryItemType",{"$nulls":3},"duration"]
["in-bse-fin","TaxExpenseOfDiscontinuedOperations",null,"Tax expense of discontinued operations",{"$nulls":6},"xbrli:monetaryItemType",{"$nulls":3},"duration"]
["in-bse-fin","ProfitLossFromDiscontinuedOperationsAfterTax",null,"Net profit (loss) from discontinued operation after tax",{"$nulls":6},"xbrli:monetaryItemType",{"$nulls":3},"duration"]
["in-bse-fin","ShareOfProfitLossOfAssociatesAndJointVenturesAccountedForUsingEquityMethod",null,"Share of profit (loss) of associates and joint ventures accounted for using equity method",{"$nulls":6},"xbrli:monetaryItemType",{"$nulls":3},"duration"]
["in-bse-fin","ProfitLossForPeriod",null,"Total profit (loss) for period",{"$nulls":6},"xbrli:monetaryItemType",{"$nulls":3},"duration"]
["in-bse-fin","OtherComprehensiveIncomeNetOfTaxes",null,"Other comprehensive income net of taxes",{"$nulls":6},"xbrli:monetaryItemType",{"$nulls":3},"duration"]
["in-bse-fin","ComprehensiveIncomeForThePeriod",null,"Total Comprehensive Income for the period",{"$nulls":6},"xbrli:monetaryItemType",{"$nulls":3},"duration"]
["in-bse-fin","ProfitOrLossAttributableToOwnersOfParent",null,"Profit or loss, attributable to owners of parent",{"$nulls":6},"xbrli:monetaryItemType",{"$nulls":3},"duration"]
["in-bse-fin","ProfitOrLossAttributableToNonControllingInterests",null,"Total profit or loss, attributable to non-controlling interests",{"$nulls":6},"xbrli:monetaryItemType",{"$nulls":3},"duration"]
["in-bse-fin","ComprehensiveIncomeForThePeriodAttributableToOwnersOfParent",null,"Comprehensive income for the period attributable to owners of parent",{"$nulls":6},"xbrli:monetaryItemType",{"$nulls":3},"duration"]
["in-bse-fin","ComprehensiveIncomeForThePeriodAttributableToOwnersOfParentNonControllingInterests",null,"Total comprehensive income for the period attributable to owners of parent non-controlling interests",{"$nulls":6},"xbrli:monetaryItemType",{"$nulls":3},"duration"]
["in-bse-fin","PaidUpValueOfEquityShareCapital",null,"Paid-up equity share capital ",{"$nulls":6},"xbrli:monetaryItemType",{"$nulls":3},"duration"]
["in-bse-fin","FaceValueOfEquityShareCapital",null,"Face value of equity share capital",{"$nulls":6},"num:perShareItemType",{"$nulls":3},"duration"]
["in-bse-fin","PaidUpValueOfDebtCapital",null,"Paid-up debt capital",{"$nulls":6},"xbrli:monetaryItemType",{"$nulls":3},"duration"]
["in-bse-fin","FaceValueOfDebtSecurities",null,"Face value of debt securities",{"$nulls":6},"num:perShareItemType",{"$nulls":3},"duration"]
["in-bse-fin","ReserveExcludingRevaluationReserves",null,"Reserves excluding revaluation reserve",{"$nulls":6},"xbrli:monetaryItemType",{"$nulls":3},"duration"]
["in-bse-fin","DebentureRedemptionReserve",null,"Debenture redemption reserve",{"$nulls":6},"xbrli:monetaryItemType",{"$nulls":3},"duration"]
["in-bse-fin","BasicEarningsLossPerShareFromContinuingOperations",null,"Basic earnings (loss) per share from continuing operations",{"$nulls":6},"num:perShareItemType",{"$nulls":3},"duration"]
["in-bse-fin","DilutedEarningsLossPerShareFromContinuingOperations",null,"Diluted earnings (loss) per share from continuing operations",{"$nulls":6},"num:perShareItemType",{"$nulls":3},"duration"]
["in-bse-fin","BasicEarningsLossPerShareFromDiscontinuedOperations",null,"Basic earnings (loss) per share from discontinued operations",{"$nulls":6},"num:perShareItemType",{"$nulls":3},"duration"]
["in-bse-fin","DilutedEarningsLossPerShareFromDiscontinuedOperations",null,"Diluted earnings (loss) per share from discontinued operations",{"$nulls":6},"num:perShareItemType",{"$nulls":3},"duration"]
["in-bse-fin","BasicEarningsLossPerShareFromContinuingAndDiscontinuedOperations",null,"Basic earnings (loss) per share from continuing and discontinued operations",{"$nulls":6},"num:perShareItemType",{"$nulls":3},"duration"]
["in-bse-fin","DilutedEarningsLossPerShareFromContinuingAndDiscontinuedOperations",null,"Diluted earnings (loss) per share from continuing and discontinued operations",{"$nulls":6},"num:perShareItemType",{"$nulls":3},"duration"]
["in-bse-fin","DebtEquityRatio",null,"Debt equity ratio",{"$nulls":6},"num:percentItemType",{"$nulls":3},"duration"]
["in-bse-fin","DebtServiceCoverageRatio",null,"Debt service coverage ratio",{"$nulls":6},"num:percentItemType",{"$nulls":3},"duration"]
["in-bse-fin","InterestServiceCoverageRatio",null,"Interest service coverage ratio",{"$nulls":6},"num:percentItemType",{"$nulls":3},"duration"]
["in-bse-fin","DisclosureOfNotesOnFinancialResultsExplanatoryTextBlock",null,"Disclosure of notes on financial results explanatory [Text Block]",{"$nulls":6},"nonnum:textBlockItemType",{"$nulls":3},"duration"]
["in-bse-fin","OtherComprehensiveItemsThatWillNotBeReclassifiedToProfitAndLossAbstract","Other comprehensive items that will not be reclassified to profit and loss [Abstract]","Other comprehensive items that will not be reclassified to profit and loss [Abstract]"]
["in-bse-fin","OtherComprehensiveItemsThatWillNotBeReclassifiedToProfitAndLossTable","Other comprehensive items that will not be reclassified to profit and loss [Table]","Other comprehensive items that will not be reclassified to profit and loss [Table]"]
["in-bse-fin","ItemsThatWillNotBeReclassifiedToProfitAndLossAxis","Items that will not be reclassified to profit and loss [Axis]","Items that will not be reclassified to profit and loss [Axis]"]
["in-bse-fin","OtherComprehensiveItemsThatWillNotBeReclassifiedToProfitAndLossLineItems","Other comprehensive items that will not be reclassified to profit and loss [Line items]","Other comprehensive items that will not be reclassified to profit and loss [Line items]"]
["in-bse-fin","DescriptionOfItemThatWillNotBeReclassifiedToProfitAndLoss","Description of item that will not be reclassified to profit and loss","Description of item that will not be reclassified to profit and loss",{"$nulls":6},"xbrli:stringItemType",{"$nulls":3},"duration"]
["in-bse-fin","AmountOfItemThatWillNotBeReclassifiedToProfitAndLoss","Amount of item that will not be reclassified to profit and loss","Amount of item that will not be reclassified to profit and loss",{"$nulls":6},"xbrli:monetaryItemType",{"$nulls":3},"duration"]
["in-bse-fin","OtherComprehensiveItemsThatWillBeReclassifiedToProfitAndLossAbstract","Other comprehensive items that will be reclassified to profit and loss [Abstract]","Other comprehensive items that will be reclassified to profit and loss [Abstract]"]
["in-bse-fin","OtherComprehensiveItemsThatWillBeReclassifiedToProfitAndLossTable","Other comprehensive items that will be reclassified to profit and loss [Table]","Other comprehensive items that will be reclassified to profit and loss [Table]"]
["in-bse-fin","ItemsThatWillBeReclassifiedToProfitAndLossAxis","Items that will be reclassified to profit and loss [Axis]","Items that will be reclassified to profit and loss [Axis]"]
["in-bse-fin","OtherComprehensiveItemsThatWillBeReclassifiedToProfitAndLossLineItems","Other comprehensive items that will be reclassified to profit and loss [Line items]","Other comprehensive items that will be reclassified to profit and loss [Line items]"]
["in-bse-fin","DescriptionOfItemThatWillBeReclassifiedToProfitAndLoss","Description of item that will be reclassified to profit and loss","Description of item that will be reclassified to profit and loss",{"$nulls":6},"xbrli:stringItemType",{"$nulls":3},"duration"]
["in-bse-fin","AmountOfItemThatWillBeReclassifiedToProfitAndLoss","Amount of item that will be reclassified to profit and loss","Amount of item that will be reclassified to profit and loss",{"$nulls":6},"xbrli:monetaryItemType",{"$nulls":3},"duration"]
["in-bse-fin","OtherComprehensiveIncomeAbstract","Other comprehensive income [Abstract]","Other comprehensive income [Abstract]"]
["in-bse-fin","AmountOfItemThatWillNotBeReclassifiedToProfitAndLoss","Amount of items that will not be reclassified to profit and loss","Amount of items that will not be reclassified to profit and loss",{"$nulls":6},"xbrli:monetaryItemType",{"$nulls":3},"duration"]
["in-bse-fin","IncomeTaxRelatingToItmesThatWillNotBeReclassifiedToProfitOrLoss","Income tax relating to items that will not be reclassified to profit or loss ","Income tax relating to items that will not be reclassified to profit or loss ",{"$nulls":6},"xbrli:monetaryItemType",{"$nulls":3},"duration"]
["in-bse-fin","AmountOfItemThatWillBeReclassifiedToProfitAndLoss","Amount of items that will be reclassified to profit and loss","Amount of items that will be reclassified to profit and loss",{"$nulls":6},"xbrli:monetaryItemType",{"$nulls":3},"duration"]
["in-bse-fin","IncomeTaxRelatingToItmesThatWillBeReclassifiedToProfitOrLoss","Income tax relating to items that will be reclassified to profit or loss ","Income tax relating to items that will be reclassified to profit or loss ",{"$nulls":6},"xbrli:monetaryItemType",{"$nulls":3},"duration"]
["in-bse-fin","OtherComprehensiveIncome","Total Other comprehensive income","Total Other comprehensive income",{"$nulls":6},"xbrli:monetaryItemType",{"$nulls":3},"duration"]
["in-bse-fin","DescriptionOfOtherExpenses",null,"Description of other expenses",{"$nulls":6},"xbrli:stringItemType",{"$nulls":3},"duration"]
["in-bse-fin","OtherExpenses",null,"Other expenses",{"$nulls":6},"xbrli:monetaryItemType",{"$nulls":3},"duration"]
["in-bse-fin","DisclosureOfNotesOnAssetsAndLiabilitiesExplanatoryTextBlock",null,"Disclosure of notes on assets and liabilities",{"$nulls":6},"nonnum:textBlockItemType",{"$nulls":3},"duration"]
["in-bse-fin","DisclosureOfNotesOnFinancialResultsExplanatoryTextBlock","Label","Disclosure of notes on financial results",{"$nulls":6},"nonnum:textBlockItemType",{"$nulls":3},"duration"]
["in-bse-fin","SegmentProfitBeforeTax",null,"Profit  before  tax",{"$nulls":6},"xbrli:monetaryItemType",{"$nulls":3},"duration"]
["in-bse-fin","SegmentProfitLossBeforeTaxAndFinanceCosts",null,"Total  Profit  before tax",{"$nulls":6},"xbrli:monetaryItemType",{"$nulls":3},"duration"]